Начало Вход/Регистрация Помощ Tazi stranica s latinski bukwi
Области
 Новини
 Актуална тема
 Linux портали
 Какво е Линукс?
 Въпроси-отговори
 Форуми
   •Трудова борса
   •Конкурс
 Статии
 Дистрибуции
   •Поръчка на CD
 Made In BG
 Файлове
 Връзки
 Галерия
 Конференции
Настройки
 Външен вид
 Предложения
 Направи си сам
И още ...
 За нас
 Линукс за българи ЕООД
 Линк към нас
 Предложения

Подкрепяно от:
TelePoint - Място за хора със свободни идеи

SiteGround

initLab

Adsys Group

SAP Bulgaria

Въпроси отговори
Въпрос: проблем при инсталиране на kbedic
[Търси: ]

ВНИМАНИЕ: Използвайте форумите на сайта за дa зададете вашите въпроси.

Към началото |Добави въпрос |Отговори
 
Въпрос
От: packo Дата: 05/19/2004
kogato mu dam komandata make i mi izpisva slednoto

lamen@cable-81-161-213-192 kbedic-4.0]$ make
Making all in src
 make[1]: Entering directory
`/home/plamen/dict/kbedic-4.0/src'
source='win.cpp' object='win.o' libtool=no \
depfile='.deps/win.Po' tmpdepfile='.deps/win.TPo' \
depmode=gcc3 /bin/sh ../depcomp \
 c++ -DPACKAGE=\"kbedic\" -DVERSION=\"4.0\" -DSTDC_HEADERS=1
 -DWITH_KDE=1  -I. -I. -I/usr/X11R6/include
 -I/usr/lib/qt3//include -INO  -Wall  -O2 -c -o win.o `test
-f win.cpp || echo './'`win.cpp
win.cpp:49:18: kapp.h: No such file or directory
win.cpp:50:22: kmenubar.h: No such file or directory
win.cpp:51:25: kfontdialog.h: No such file or directory
win.cpp: In constructor `Win::Win(QWidget*, const char*)':
 win.cpp:280: error: `qApp' undeclared (first use this
function)
 win.cpp:280: error: (Each undeclared identifier is reported
only once for each function it appears in.)
 win.cpp:310: error: `KMenuBar' undeclared (first use this
function)
 win.cpp:310: error: `menu' undeclared (first use this
function)
win.cpp:310: error: syntax error before `(' token
 win.cpp:373: error: `KApplication' undeclared (first use
this function)
win.cpp:373: error: syntax error before `::' token
win.cpp: In member function `void Win::menu_Font()':
 win.cpp:1059: error: `KFontDialog' undeclared (first use
this function)
win.cpp:1059: error: syntax error before `::' token
win.cpp:1059: error: syntax error before `)' token
win.cpp: In member function `void Win::setView(int)':
 win.cpp:1172: error: `height' undeclared (first use this
function)
 win.cpp: In member function `virtual void
Win::resizeEvent(QResizeEvent*)':
 win.cpp:1243: error: `height' undeclared (first use this
function)
make[1]: *** [win.o] Error 1
 make[1]: Leaving directory
`/home/plamen/dict/kbedic-4.0/src'
make: *** [all-recursive] Error 1

 kakyv e problema i na4ina za reshavaneto mu. 10x
preeeeedvaritelno


Отговор #1
От: milen4o Дата: 05/19/2004
Имаш ли KDE?
Компилираш ли под root?

реда е :

./configure
make
make install


Отговор #2
От: Plamen Дата: 05/19/2004
http://www.linux-bg.org/cgi-bin/y/index.pl?page=forum&msg=6889
Научете се да ползвате търсачката на сайта!!!


Отговор #3
От: aaaaaa Дата: 05/19/2004
"Компилираш ли под root?"
НЕ трябва!


Отговор #4
От: milen4o Дата: 05/19/2004
 при мен трябва, защото до някои библиотеки с обикновен юзър
не достигам :) Стандартна инсталациа на RH9!


Отговор #5
От: packo Дата: 05/20/2004
 компилирах и под root и като обикновен потребител, но ми
 изписва същата грешка. прочетох и това което пламен ми е
 пратил като линк, но и така не става - същата грешка ми
 изписва. Тъй като съм начинаещ не знам каква е причината за
това.


Отговор #6
От: Genata Дата: 05/20/2004
Прочети коментарите тук:
http://www.linux-bg.org/cgi-bin/y/index.pl?page=repository&key=352306303
Може би това ще ти помогне


<< линк за Законопроекта (2 ) | daite mi link... (2 ) >>

 
© 2011-... Асоциация "Линукс за българи"
© 2007-2010 Линукс за българи ЕООД
© 1999-2006 Slavej Karadjov
Ако искате да препечатате или цитирате информация от този сайт прочетете първо това
Външния вид е направен от MOMCHE
Code Version: 1.0.8 H (Revision: 23-09-2011)
 
Изпълнението отне: 0 wallclock secs ( 0.08 usr + 0.00 sys = 0.08 CPU)